BDBM255472 US9481682, 84
SMILES CN1CC[C@H]2CC[C@@H](CN2C1=O)c1nc(-c2ccc(cc2)C(=O)Nc2cc(ccn2)C(F)(F)F)c2c(N)nccn12
InChI Key InChIKey=NHGWRSGWOHSFKY-AZUAARDMSA-N
Data  1 IC50
  Tab Delimited (TSV)   2D SDfile   Computed 3D by Vconf -m prep SDfile
Find this compound or compounds like it in BindingDB:
Activity Spreadsheet -- Enzyme Inhibition Constant Data from BindingDB
Found 1 hit for monomerid = 255472
TargetTyrosine-protein kinase BTK(Homo sapiens (Human))
Merck Sharp & Dohme
US Patent
LigandPNGBDBM255472(US9481682, 84)
Affinity DataIC50:  3nM. Assay description: BTK enzymatic activity was determined with the LANCE (Lanthanide Chelate Excite) TR-FRET (Time-resolved fluorescence resonance energy transfer) assay...
Ligand InfoPC cidPC sid
In DepthDetails US Patent