BDBM255904 US9481672, 56
SMILES CCOC(=O)c1cn(-c2ccc3N(C)C(=O)C(C)(C)c3c2)c(=O)n(Cc2cccc(Cl)c2Cl)c1=O
InChI Key InChIKey=YSYHJQQNCLSPSE-UHFFFAOYSA-N
Data  1 IC50
  Tab Delimited (TSV)   2D SDfile   Computed 3D by Vconf -m prep SDfile
Find this compound or compounds like it in BindingDB:
Activity Spreadsheet -- Enzyme Inhibition Constant Data from BindingDB
Found 1 hit for monomerid = 255904
Targetchymase(Mesocricetus auratus (Golden hamster))
Bayer Pharma Aktiengesellschaft
US Patent
LigandPNGBDBM255904(US9481672, 56)
Affinity DataIC50:  67nMpH: 7.5Assay Description:The enzyme source used is recombinant human chymase (expressed in HEK293 cells) or chymase purified from hamsters' tongues. The substrate used for ch...
Ligand InfoPC cidPC sid
In DepthDetails US Patent