BDBM256104 US9481672, 286
SMILES COC(=O)c1cn(-c2ccc3n(C)c(=O)oc3c2)c(=O)n([C@@H]2CCCc3c(Cl)cccc23)c1=O
InChI Key InChIKey=DECVKLSZNYIWAB-GOSISDBHSA-N
Data  1 IC50
  Tab Delimited (TSV)   2D SDfile   Computed 3D by Vconf -m prep SDfile
Find this compound or compounds like it in BindingDB:
Activity Spreadsheet -- Enzyme Inhibition Constant Data from BindingDB
Found 1 hit for monomerid = 256104
Targetchymase(Mesocricetus auratus (Golden hamster))
Bayer Pharma Aktiengesellschaft
US Patent
LigandPNGBDBM256104(US9481672, 286)
Affinity DataIC50:  37nMpH: 7.5Assay Description:The enzyme source used is recombinant human chymase (expressed in HEK293 cells) or chymase purified from hamsters' tongues. The substrate used for ch...
Ligand InfoPC cidPC sid
In DepthDetails US Patent