BDBM25619 (1Z)-5-[1-methyl-3-(pyridin-4-yl)-1H-pyrazol-4-yl]-2,3-dihydro-1H-indene-1-hydroxylamine::pyrazole-based inhibitor, 2a
SMILES Cn1cc(c(n1)-c1ccncc1)-c1ccc2C(CCc2c1)N=O
InChI Key InChIKey=YHYOXKSUCQMRRA-UHFFFAOYSA-N
Data  1 IC50
  Tab Delimited (TSV)   2D SDfile   Computed 3D by Vconf -m prep SDfile
Find this compound or compounds like it in BindingDB:
Activity Spreadsheet -- Enzyme Inhibition Constant Data from BindingDB
Found 1 hit for monomerid = 25619
TargetSerine/threonine-protein kinase B-raf(Homo sapiens (Human))
Array Biopharma
LigandPNGBDBM25619((1Z)-5-[1-methyl-3-(pyridin-4-yl)-1H-pyrazol-4-yl]...)
Affinity DataIC50:  0.0200nMpH: 7.2 T: 2°C. Assay description: Activity of human recombinant B-Raf protein was assessed in vitro by assay of the incorporation of radiolabeled phosphate to recombinant MAP kinase (...
In DepthDetails ArticlePubMed