BDBM256307 US9487488, 31
SMILES FC(F)(F)c1ccc(CN(c2ncc3ccccc3c2C2CC2)S(=O)(=O)c2ccc(cc2)-c2noc(=O)[nH]2)nc1
InChI Key InChIKey=UTSFDPFAAXWAOC-UHFFFAOYSA-N
Data  1 IC50
  Tab Delimited (TSV)   2D SDfile   Computed 3D by Vconf -m prep SDfile
Find this compound or compounds like it in BindingDB:
Activity Spreadsheet -- Enzyme Inhibition Constant Data from BindingDB
Found 1 hit for monomerid = 256307
TargetTransient receptor potential cation channel subfamily M member 8(Homo sapiens (Human))
Mitsubishi Tanabe Pharma
US Patent
LigandPNGBDBM256307(US9487488, 31)
Affinity DataIC50:  1.10nMT: 2°C. Assay description: The functional activity of a test compound was determined by measuring change in intracellular calcium concentration using a calcium sensitive fluore...
Ligand InfoPC cidPC sid
In DepthDetails US Patent