BDBM25639 (1Z)-5-[1-(piperidin-4-ylmethyl)-3-(pyridin-4-yl)-1H-pyrazol-4-yl]-2,3-dihydro-1H-indene-1-hydroxylamine::pyrazole based inhibitor, 21
SMILES O=NC1CCc2cc(ccc12)-c1cn(CC2CCNCC2)nc1-c1ccncc1
InChI Key InChIKey=XGNQOONJLJPCDZ-UHFFFAOYSA-N
Data  1 IC50
  Tab Delimited (TSV)   2D SDfile   Computed 3D by Vconf -m prep SDfile
Find this compound or compounds like it in BindingDB:
Activity Spreadsheet -- Enzyme Inhibition Constant Data from BindingDB
Found 1 hit for monomerid = 25639
TargetSerine/threonine-protein kinase B-raf(Homo sapiens (Human))
Array Biopharma
LigandPNGBDBM25639((1Z)-5-[1-(piperidin-4-ylmethyl)-3-(pyridin-4-yl)-...)
Affinity DataIC50:  1.20nMpH: 7.2 T: 2°C. Assay description: Activity of human recombinant B-Raf protein was assessed in vitro by assay of the incorporation of radiolabeled phosphate to recombinant MAP kinase (...
In DepthDetails ArticlePubMed