BDBM256455 US9487501, 56
SMILES O=C(Nc1ccc(cc1)[C@H]1CNCCO1)c1cnn(c1)-c1cc(ncn1)C1CC1
InChI Key InChIKey=AVLAZSACGWVQTL-LJQANCHMSA-N
Data  2 KI
  Tab Delimited (TSV)   2D SDfile   Computed 3D by Vconf -m prep SDfile
Find this compound or compounds like it in BindingDB:
Activity Spreadsheet -- Enzyme Inhibition Constant Data from BindingDB
Found 2 hits for monomerid = 256455
TargetTrace amine-associated receptor 1(Mus musculus (Mouse))
Hoffmann-La Roche
US Patent
LigandPNGBDBM256455(US9487501, 56)
Affinity DataKi:  5.10nM ΔG°:  -11.8kcal/molepH: 7.4 T: 2°C. Assay description: HEK-293 cells stably expressing mouse TAAR1 were maintained at 37° C. and 5% CO2 in DMEM high glucose medium, containing fetal calf serum (10%, h...
Ligand InfoPC cidPC sid
In DepthDetails US Patent
TargetTrace amine-associated receptor 1(Rattus norvegicus (Rat))
Hoffmann-La Roche
US Patent
LigandPNGBDBM256455(US9487501, 56)
Affinity DataKi:  5.20nM ΔG°:  -11.7kcal/molepH: 7.4 T: 2°C. Assay description: HEK-293 cells stably expressing rat TAAR1 were maintained at 37° C. and 5% CO2 in DMEM high glucose medium, containing fetal calf serum (10%, hea...
Ligand InfoPC cidPC sid
In DepthDetails US Patent