BDBM25669 4-[(5-bromo-1,3-thiazol-2-yl)amino]phenol::aminothiazole analogue, 13
SMILES Oc1ccc(Nc2ncc(Br)s2)cc1
InChI Key InChIKey=AWMZASLWFWZYDR-UHFFFAOYSA-N
Data  1 IC50
  Tab Delimited (TSV)   2D SDfile   Computed 3D by Vconf -m prep SDfile
Find this compound or compounds like it in BindingDB:
Activity Spreadsheet -- Enzyme Inhibition Constant Data from BindingDB
Found 1 hit for monomerid = 25669
TargetAurora kinase A(Homo sapiens (Human))
Novartis
LigandPNGBDBM25669(4-[(5-bromo-1,3-thiazol-2-yl)amino]phenol | aminot...)
Affinity DataIC50:  510nMpH: 7.0 T: 2°C. Assay description: The biochemical activity of compounds was determined by incubation with Aurora A and substrates in the presence ATP/[gamma-33P] ATP. After incubatio...
In DepthDetails ArticlePubMed