BDBM25696 aminothiazole analogue, 40::ethyl 3-[(5-bromo-1,3-thiazol-2-yl)amino]benzoate
SMILES CCOC(=O)c1cccc(Nc2ncc(Br)s2)c1
InChI Key InChIKey=PQRPLOWSMMVJBP-UHFFFAOYSA-N
Data  1 IC50
  Tab Delimited (TSV)   2D SDfile   Computed 3D by Vconf -m prep SDfile
Find this compound or compounds like it in BindingDB:
Activity Spreadsheet -- Enzyme Inhibition Constant Data from BindingDB
Found 1 hit for monomerid = 25696
TargetAurora kinase A(Homo sapiens (Human))
Novartis
LigandPNGBDBM25696(aminothiazole analogue, 40 | ethyl 3-[(5-bromo-1,3...)
Affinity DataIC50:  2.25E+3nM. Assay description: The biochemical activity of compounds was determined by incubation with Aurora A and substrates in the presence ATP/[gamma-33P] ATP. After incubatio...
In DepthDetails ArticlePubMed