BDBM257057 US9493435, 75
SMILES Oc1ccc2cc(ccc2c1C=O)-c1ccc(s1)C(=O)N1CC2CC1CN2
InChI Key InChIKey=DRNXTSVLSWGSMJ-UHFFFAOYSA-N
Data  1 IC50
  Tab Delimited (TSV)   2D SDfile   Computed 3D by Vconf -m prep SDfile
Find this compound or compounds like it in BindingDB:
Activity Spreadsheet -- Enzyme Inhibition Constant Data from BindingDB
Found 1 hit for monomerid = 257057
LigandPNGBDBM257057(US9493435, 75)
Affinity DataIC50: <100nMpH: 7.5 T: 2°C. Assay description: A fusion protein comprising glutathione S transferase (GST) and human IRE-1α (GST-IRE-1α) obtained from a 500 ml baculovirus-infected ins...
Ligand InfoPC cidPC sid
In DepthDetails US Patent