BDBM257564 US9493446, 34
SMILES COc1c(F)cccc1-c1noc(n1)[C@@H]1CCCN1C(=O)c1cc(C)ccc1-n1nccn1
InChI Key InChIKey=GHZBHHGLXHLLGK-IBGZPJMESA-N
Data  2 IC50
  Tab Delimited (TSV)   2D SDfile   Computed 3D by Vconf -m prep SDfile
Find this compound or compounds like it in BindingDB:
Activity Spreadsheet -- Enzyme Inhibition Constant Data from BindingDB
Found 2 hits for monomerid = 257564
TargetOrexin receptor type 2(Homo sapiens (Human))
Actelion Pharmaceuticals
US Patent
LigandPNGBDBM257564(US9493446, 34)
Affinity DataIC50:  8nMT: 2°C. Assay description: Human orexin-A as an agonist is prepared as 1 mM stock solution in MeOH: water (1:1), diluted in HBSS containing 0.1% bovine serum albumin (BSA), NaH...
Ligand InfoPC cidPC sid
In DepthDetails US Patent
TargetOrexin/Hypocretin receptor type 1(Homo sapiens (Human))
Actelion Pharmaceuticals
US Patent
LigandPNGBDBM257564(US9493446, 34)
Affinity DataIC50:  51nMT: 2°C. Assay description: Human orexin-A as an agonist is prepared as 1 mM stock solution in MeOH: water (1:1), diluted in HBSS containing 0.1% bovine serum albumin (BSA), NaH...
Ligand InfoPC cidPC sid
In DepthDetails US Patent