BDBM25773 1-[(4-methylphenyl)carbonyl]-4-phenylpiperazine::piperazine, a2
SMILES Cc1ccc(cc1)C(=O)N1CCN(CC1)c1ccccc1
InChI Key InChIKey=MPTWQLUMMRYFPO-UHFFFAOYSA-N
Data  1 IC50
  Tab Delimited (TSV)   2D SDfile   Computed 3D by Vconf -m prep SDfile
Find this compound or compounds like it in BindingDB:
Activity Spreadsheet -- Enzyme Inhibition Constant Data from BindingDB
Found 1 hit for monomerid = 25773
TargetEnoyl-[acyl-carrier-protein] reductase [NADH](Mycobacterium tuberculosis (strain ATCC 25618 / H3...)
Incyte
LigandPNGBDBM25773(1-[(4-methylphenyl)carbonyl]-4-phenylpiperazine | ...)
Affinity DataIC50:  1.66E+4nMpH: 6.8 T: 2°C. Assay description: The assay measured the NADH-dependent catalysis of an octenoyl-CoA substrate as a decrease in 340 nm absorbance resulting from conversion of NADH to ...
In DepthDetails ArticlePubMed