BDBM258590 US9493486, 15B
SMILES Fc1cc(OC(F)(F)F)ccc1COC(=O)N1CCC2(CN(C2)C(=O)[C@@H]2CCc3[nH]nnc3C2)CC1
InChI Key
Data  1 IC50
  Tab Delimited (TSV)   2D SDfile   Computed 3D by Vconf -m prep SDfile
Find this compound or compounds like it in BindingDB:
Activity Spreadsheet -- Enzyme Inhibition Constant Data from BindingDB
Found 1 hit for monomerid = 258590
TargetEctonucleotide pyrophosphatase/phosphodiesterase family member 2(Homo sapiens (Human))
Hoffmann-La Roche
US Patent
LigandPNGBDBM258590(US9493486, 15B)
Affinity DataIC50:  1nMpH: 8.0 T: 2°C. Assay description: ATX inhibition was measured by a fluorescence quenching assay using a specifically labeled substrate analogue (MR121 substrate). To obtain this MR121...
Ligand InfoPC cidPC sid
In DepthDetails US Patent