BDBM258779 US9499482, 185
SMILES OC1CN(CCOc2ccc(cc2OC(F)F)N2CC=C(Oc3ccc(cc3)C3CC3)C2=O)C1
InChI Key InChIKey=CGZDIIHJVBUGSA-UHFFFAOYSA-N
Data  1 KI
  Tab Delimited (TSV)   2D SDfile   Computed 3D by Vconf -m prep SDfile
Find this compound or compounds like it in BindingDB:
Activity Spreadsheet -- Enzyme Inhibition Constant Data from BindingDB
Found 1 hit for monomerid = 258779
TargetMelanin-concentrating hormone receptor 1 [E4Q,A5T](Homo sapiens (Human))
Bristol-Myers Squibb
US Patent
LigandPNGBDBM258779(US9499482, 185)
Affinity DataKi:  0.600nMpH: 7.4Assay Description:An in vitro binding assay was used to determine the compound Ki value or ability to antagonize binding of a peptide agonist to the human melanin conc...
Ligand InfoPC cidPC sid
In DepthDetails US Patent