BDBM258895 US9499502, 5
SMILES CC1(C)C(=N)N[C@@](C)(CS1(=O)=O)c1cc(NC(=O)c2ccc(Cl)cn2)ccc1F
InChI Key InChIKey=LMHDJRUKZXENER-IBGZPJMESA-N
Data  2 KI
  Tab Delimited (TSV)   2D SDfile   Computed 3D by Vconf -m prep SDfile
Find this compound or compounds like it in BindingDB:
Activity Spreadsheet -- Enzyme Inhibition Constant Data from BindingDB
Found 2 hits for monomerid = 258895
TargetBeta-secretase 1(Homo sapiens (Human))
Merck Sharp & Dohme
US Patent
LigandPNGBDBM258895(US9499502, 5)
Affinity DataKi:  1nM ΔG°:  -12.5kcal/molepH: 5.0 T: 2°C. Assay description: A homogeneous time-resolved FRET assay can be used to determine IC50 values for inhibitors of the soluble human BACE1 catalytic domain. This assay mo...
Ligand InfoPC cidPC sid
In DepthDetails US Patent
TargetBeta-secretase 2(Homo sapiens (Human))
Merck Sharp & Dohme
US Patent
LigandPNGBDBM258895(US9499502, 5)
Affinity DataKi: <10nM ΔG°: <-11.1kcal/molepH: 5.0 T: 2°C. Assay description: Inhibitor IC50s at purified human autoBACE-2 are determined in a time-resolved endpoint proteolysis assay that measures hydrolysis of the QSY7-EISEVN...
Ligand InfoPC cidPC sid
In DepthDetails US Patent