BDBM259554 US9505749, 65
SMILES O=C(CCCc1nc2ccccc2c(=O)[nH]1)N[C@H]1CC[C@@H](C1)Oc1ccccc1
InChI Key
Data  4 IC50
  Tab Delimited (TSV)   2D SDfile   Computed 3D by Vconf -m prep SDfile
Find this compound or compounds like it in BindingDB:
Activity Spreadsheet -- Enzyme Inhibition Constant Data from BindingDB
Found 4 hits for monomerid = 259554
TargetPoly [ADP-ribose] polymerase tankyrase-1 [1091-1325](Homo sapiens (Human))
Amgen
US Patent
LigandPNGBDBM259554(US9505749, 65)
Affinity DataIC50:  1.60E+3nM. Assay description: The tankyrase 1 biochemical activity of the compounds was assayed in the following assay buffer (50 mM MOPS pH7.5, 100 mM NaCl, 2.5 mM MgCl2, 0.01% T...
Ligand InfoPC cidPC sid
In DepthDetails US Patent
TargetPoly [ADP-ribose] polymerase 2(Homo sapiens (Human))
Amgen
US Patent
LigandPNGBDBM259554(US9505749, 65)
Affinity DataIC50:  893nM. Assay description: PARP1 biochemical assay was purchased as a kit from Trevigen (cat.#4676-096-K) and used per manufacturers recommendations.PARP2 biochemical assay was...
Ligand InfoPC cidPC sid
In DepthDetails US Patent
TargetPoly [ADP-ribose] polymerase 1(Homo sapiens (Human))
Amgen
US Patent
LigandPNGBDBM259554(US9505749, 65)
Affinity DataIC50:  1.29E+3nM. Assay description: PARP1 biochemical assay was purchased as a kit from Trevigen (cat.#4676-096-K) and used per manufacturers recommendations.PARP2 biochemical assay was...
Ligand InfoPC cidPC sid
In DepthDetails US Patent
TargetPoly [ADP-ribose] polymerase tankyrase-2 [946-1162](Homo sapiens (Human))
Amgen
US Patent
LigandPNGBDBM259554(US9505749, 65)
Affinity DataIC50:  318nM. Assay description: The tankyrase 1 biochemical activity of the compounds was assayed in the following assay buffer (50 mM MOPS pH7.5, 100 mM NaCl, 2.5 mM MgCl2, 0.01% T...
Ligand InfoPC cidPC sid
In DepthDetails US Patent