BDBM260177 US9504692, 4037
SMILES C(N1c2ccccc2Sc2ccccc12)c1ccccc1
InChI Key InChIKey=HZZYXQYXUHBZJB-UHFFFAOYSA-N
Data  1 IC50
  Tab Delimited (TSV)   2D SDfile   Computed 3D by Vconf -m prep SDfile
Find this compound or compounds like it in BindingDB:
Activity Spreadsheet -- Enzyme Inhibition Constant Data from BindingDB
Found 1 hit for monomerid = 260177
LigandPNGBDBM260177(US9504692, 4037)
Affinity DataIC50:  2.67E+3nMT: 2°C. Assay description: To screen for small molecular weight compounds that can inhibit MALT1 protease activity, recombinant GSTMALT1 was purified from E. coli to establish ...
In DepthDetails US Patent