BDBM260220 US9522914, A-22
SMILES COc1cc(ccc1F)-c1nc(cn1CC(=O)NC(C)C)-c1ccc(CCN2C3CCC2COC3)cc1
InChI Key InChIKey=BEZFRLHFLSXCGB-UHFFFAOYSA-N
Data  2 IC50
  Tab Delimited (TSV)   2D SDfile   Computed 3D by Vconf -m prep SDfile
Find this compound or compounds like it in BindingDB:
Activity Spreadsheet -- Enzyme Inhibition Constant Data from BindingDB
Found 2 hits for monomerid = 260220
TargetVasopressin V1b receptor(Homo sapiens (Human))
Taisho Pharmaceutical
US Patent
LigandPNGBDBM260220(US9522914, A-22)
Affinity DataIC50:  2.60nMpH: 7.4 T: 2°C. Assay description: Human V1b receptor was transiently expressed in 293FT cells (Invitrogen). The cells were collected and then homogenated in a 15 mmol/L tris-hydrochlo...
Ligand InfoPC cidPC sid
In DepthDetails US Patent
TargetVasopressin V1b receptor(Homo sapiens (Human))
Taisho Pharmaceutical
US Patent
LigandPNGBDBM260220(US9522914, A-22)
Affinity DataIC50:  2.60nMpH: 7.4 T: 2°C. Assay description: Human V1b receptor was transiently expressed in 293FT cells (Invitrogen). The cells were collected and then homogenated in a 15 mmol/L tris-hydrochlo...
Ligand InfoPC cidPC sid
In DepthDetails US Patent