BDBM260425 US9527838, 53
SMILES CCOC(=O)Cc1nc(NC(=O)c2nc(Sc3nncn3C)ccc2Sc2ccc(Cl)c(Cl)c2)sc1Cl
InChI Key InChIKey=QVXZFXGJHKJNQN-UHFFFAOYSA-N
Data  1 EC50
  Tab Delimited (TSV)   2D SDfile   Computed 3D by Vconf -m prep SDfile
Find this compound or compounds like it in BindingDB:
Activity Spreadsheet -- Enzyme Inhibition Constant Data from BindingDB
Found 1 hit for monomerid = 260425
TargetHexokinase-4(Homo sapiens (Human))
Merck Sharp & Dohme
US Patent
LigandPNGBDBM260425(US9527838, 53)
Affinity DataEC50:  7.60nM. Assay description: Recombinant human liver glucokinase was expressed as a FLAG fusion protein in E. coli, and purified on ANTIFLAG M2 AFFINITY GEL (Sigma). The assay wa...
Ligand InfoPC cidPC sid
In DepthDetails US Patent