BDBM260426 US9527838, 54
SMILES Cn1cnnc1Sc1ccc(Sc2ccc(Cl)c(Cl)c2)c(n1)C(=O)Nc1nc(CC(O)=O)c(Cl)s1
InChI Key InChIKey=FLGYREZRHWRPJM-UHFFFAOYSA-N
Data  1 EC50
  Tab Delimited (TSV)   2D SDfile   Computed 3D by Vconf -m prep SDfile
Find this compound or compounds like it in BindingDB:
Activity Spreadsheet -- Enzyme Inhibition Constant Data from BindingDB
Found 1 hit for monomerid = 260426
TargetHexokinase-4(Homo sapiens (Human))
Merck Sharp & Dohme
US Patent
LigandPNGBDBM260426(US9527838, 54)
Affinity DataEC50:  23.3nM. Assay description: Recombinant human liver glucokinase was expressed as a FLAG fusion protein in E. coli, and purified on ANTIFLAG M2 AFFINITY GEL (Sigma). The assay wa...
Ligand InfoPC cidPC sid
In DepthDetails US Patent