BDBM260701 US9533989, 11
SMILES COc1cc(Nc2nc(N[C@@H]3CCCC[C@@H]3N)nc(O)c2C(N)=O)cc(OC)c1
InChI Key InChIKey=PFAQAOUYOIDPJN-UONOGXRCSA-N
Data  1 IC50
  Tab Delimited (TSV)   2D SDfile   Computed 3D by Vconf -m prep SDfile
Find this compound or compounds like it in BindingDB:
Activity Spreadsheet -- Enzyme Inhibition Constant Data from BindingDB
Found 1 hit for monomerid = 260701
TargetTyrosine-protein kinase SYK(Homo sapiens (Human))
Ziarco Pharma
US Patent
LigandPNGBDBM260701(US9533989, 11)
Affinity DataIC50:  3.86nM. Assay description: The Promega ADP-Glo Kinase Assay is a luminescent ADP detection assay that provides a universal, homogeneous, high-throughput screening method to mea...
Ligand InfoPC cidPC sid
In DepthDetails US Patent