BDBM260727 US9533989, 37
SMILES COc1ccccc1CCn1ccc2c(Nc3nc(N[C@@H]4CCCC[C@@H]4N)ncc3C(N)=O)cccc12
InChI Key InChIKey=MBPKKWCUHKFSTP-JTHBVZDNSA-N
Data  1 IC50
  Tab Delimited (TSV)   2D SDfile   Computed 3D by Vconf -m prep SDfile
Find this compound or compounds like it in BindingDB:
Activity Spreadsheet -- Enzyme Inhibition Constant Data from BindingDB
Found 1 hit for monomerid = 260727
TargetTyrosine-protein kinase SYK(Homo sapiens (Human))
Ziarco Pharma
US Patent
LigandPNGBDBM260727(US9533989, 37)
Affinity DataIC50:  12.7nM. Assay description: The Promega ADP-Glo Kinase Assay is a luminescent ADP detection assay that provides a universal, homogeneous, high-throughput screening method to mea...
Ligand InfoPC cidPC sid
In DepthDetails US Patent