BDBM260958 US9540323, 154::US9540323, example 154
SMILES CC1(C)CN(c2c1c(-c1nc3cc(F)ccc3s1)c(F)cc2O)c1ccccc1NC(=O)Nc1nc2ccc(Cl)cc2s1
InChI Key InChIKey=BOSVWMSLOVEZGZ-UHFFFAOYSA-N
Data  1 KI
  Tab Delimited (TSV)   2D SDfile   Computed 3D by Vconf -m prep SDfile
Find this compound or compounds like it in BindingDB:
Activity Spreadsheet -- Enzyme Inhibition Constant Data from BindingDB
Found 1 hit for monomerid = 260958
TargetP2Y purinoceptor 1(Homo sapiens (Human))
Bristol-Myers Squibb
US Patent
LigandPNGBDBM260958(US9540323, 154 | US9540323, example 154)
Affinity DataKi:  23nM ΔG°:  -10.4kcal/molepH: 7.4 T: 2°C. Assay description: A SPA membrane binding assay was used to identify inhibitors of [33P] 2MeS-ADP binding to cloned human P2Y1 receptors (The P2Y1 receptor membranes we...
Ligand InfoPC cidPC sid
In DepthDetails US Patent