BDBM261649 5-(4-(4-methylpiperazine-1-carbonyl)phenyl)-N-(4-(3-((triisopropylsilyl)ethynyl)phenyl)thiazol-2-yl)furan-2-carboxamide::US9708279, 26
SMILES CC(C)[Si](C#Cc1cccc(c1)-c1csc(NC(=O)c2ccc(o2)-c2ccc(cc2)C(=O)N2CCN(C)CC2)n1)(C(C)C)C(C)C
InChI Key InChIKey=IGPGUIOFXAHCOQ-UHFFFAOYSA-N
Data  2 IC50
  Tab Delimited (TSV)   2D SDfile   Computed 3D by Vconf -m prep SDfile
Find this compound or compounds like it in BindingDB:
Activity Spreadsheet -- Enzyme Inhibition Constant Data from BindingDB
Found 2 hits for monomerid = 261649
TargetALK tyrosine kinase receptor [L1196M](Homo sapiens (Human))
UniversitÁ
US Patent
LigandPNGBDBM261649(5-(4-(4-methylpiperazine-1-carbonyl)phenyl)-N-(4-(...)
Affinity DataIC50:  44.6nMpH: 7.5 T: 2°C. Assay description: GST-tagged recombinant wild-type or L1196M mutated ALK kinase (rALK) was expressed in Sf9 insect cells using the pBacPAK baculovirus vector system (C...
Ligand InfoPC cidPC sid
In DepthDetails US Patent
TargetALK tyrosine kinase receptor(Homo sapiens (Human))
UniversitÁ
US Patent
LigandPNGBDBM261649(5-(4-(4-methylpiperazine-1-carbonyl)phenyl)-N-(4-(...)
Affinity DataIC50:  420nMpH: 7.5 T: 2°C. Assay description: GST-tagged recombinant wild-type or L1196M mutated ALK kinase (rALK) was expressed in Sf9 insect cells using the pBacPAK baculovirus vector system (C...
Ligand InfoPC cidPC sid
In DepthDetails US Patent