BDBM262215 3-(4-cyanocyclohex-1-en-1- yl)-2-(2H-tetrazol-5- yl)benzenesulfonamide::US9708336, 64
SMILES NS(=O)(=O)c1cccc(C2=CCC(CC2)C#N)c1-c1nn[nH]n1
InChI Key
Data  3 IC50
  Tab Delimited (TSV)   2D SDfile   Computed 3D by Vconf -m prep SDfile
Find this compound or compounds like it in BindingDB:
Activity Spreadsheet -- Enzyme Inhibition Constant Data from BindingDB
Found 3 hits for monomerid = 262215
TargetMetallo-beta-lactamase type 2(Serratia marcescens)
Merck Sharp & Dohme
US Patent
LigandPNGBDBM262215(3-(4-cyanocyclohex-1-en-1- yl)-2-(2H-tetrazol-5- y...)
Affinity DataIC50:  248nMpH: 7.0Assay Description:The Class B enzyme activities were measured in the presence of the test inhibitor in a fluorescence assay against a commercially available substrate ...
Ligand InfoPC cidPC sid
In DepthDetails US Patent
TargetVIM-1 metallo-beta-lactamase(Klebsiella pneumoniae)
Merck Sharp & Dohme
US Patent
LigandPNGBDBM262215(3-(4-cyanocyclohex-1-en-1- yl)-2-(2H-tetrazol-5- y...)
Affinity DataIC50:  588nMpH: 7.0Assay Description:The Class B enzyme activities were measured in the presence of the test inhibitor in a fluorescence assay against a commercially available substrate ...
Ligand InfoPC cidPC sid
In DepthDetails US Patent
TargetMetallo-beta-lactamase type 2(Klebsiella pneumoniae)
Merck Sharp & Dohme
US Patent
LigandPNGBDBM262215(3-(4-cyanocyclohex-1-en-1- yl)-2-(2H-tetrazol-5- y...)
Affinity DataIC50:  13.4nMpH: 7.0Assay Description:The Class B enzyme activities were measured in the presence of the test inhibitor in a fluorescence assay against a commercially available substrate ...
Ligand InfoPC cidPC sid
In DepthDetails US Patent