BDBM26235 N-[2-(3,5-dimethyl-1H-pyrazol-1-yl)-6-(2-fluoro-3-methoxyphenyl)pyrimidin-4-yl]acetamide::pyrazolylpyrimidine derivative, 6e
SMILES COc1cccc(c1F)-c1cc(NC(C)=O)nc(n1)-n1nc(C)cc1C
InChI Key InChIKey=MHSIRMSFRHMBDY-UHFFFAOYSA-N
Data  2 KI
  Tab Delimited (TSV)   2D SDfile   Computed 3D by Vconf -m prep SDfile
Find this compound or compounds like it in BindingDB:
Activity Spreadsheet -- Enzyme Inhibition Constant Data from BindingDB
Found 2 hits for monomerid = 26235
TargetAdenosine receptor A2a(Homo sapiens (Human))
Neurocrine Bioscience
LigandPNGBDBM26235(N-[2-(3,5-dimethyl-1H-pyrazol-1-yl)-6-(2-fluoro-3-...)
Affinity DataKi:  0.600nM ΔG°:  -12.4kcal/molepH: 7.4 T: 2°C. Assay description: The membranes prepared from HEK cells transfected with adenosine receptors were used in binding assays. Nonspecific binding was determined in the pre...
In DepthDetails ArticlePubMed
TargetAdenosine receptor A1(Homo sapiens (Human))
Neurocrine Bioscience
LigandPNGBDBM26235(N-[2-(3,5-dimethyl-1H-pyrazol-1-yl)-6-(2-fluoro-3-...)
Affinity DataKi:  110nM. Assay description: The membranes prepared from HEK cells transfected with adenosine receptors were used in binding assays. Nonspecific binding was determined in the pre...
In DepthDetails ArticlePubMed