BDBM262682 3-(2-Aminobenzo[d]thiazol-4-yl)-6- (cyclobutylmethyl)-2-(2H-tetrazol-5- yl)benzenesulfonamide::US9708336, 535
SMILES Nc1nc2c(cccc2s1)-c1ccc(CC2CCC2)c(c1-c1nn[nH]n1)S(N)(=O)=O
InChI Key InChIKey=NQUOZYSKCWWHKK-UHFFFAOYSA-N
Data  3 IC50
  Tab Delimited (TSV)   2D SDfile   Computed 3D by Vconf -m prep SDfile
Find this compound or compounds like it in BindingDB:
Activity Spreadsheet -- Enzyme Inhibition Constant Data from BindingDB
Found 3 hits for monomerid = 262682
TargetMetallo-beta-lactamase type 2(Serratia marcescens)
Merck Sharp & Dohme
US Patent
LigandPNGBDBM262682(3-(2-Aminobenzo[d]thiazol-4-yl)-6- (cyclobutylmeth...)
Affinity DataIC50:  6.86nMpH: 7.0Assay Description:The Class B enzyme activities were measured in the presence of the test inhibitor in a fluorescence assay against a commercially available substrate ...
Ligand InfoPC cidPC sid
In DepthDetails US Patent
TargetVIM-1 metallo-beta-lactamase(Klebsiella pneumoniae)
Merck Sharp & Dohme
US Patent
LigandPNGBDBM262682(3-(2-Aminobenzo[d]thiazol-4-yl)-6- (cyclobutylmeth...)
Affinity DataIC50:  2.71nMpH: 7.0Assay Description:The Class B enzyme activities were measured in the presence of the test inhibitor in a fluorescence assay against a commercially available substrate ...
Ligand InfoPC cidPC sid
In DepthDetails US Patent
TargetMetallo-beta-lactamase type 2(Klebsiella pneumoniae)
Merck Sharp & Dohme
US Patent
LigandPNGBDBM262682(3-(2-Aminobenzo[d]thiazol-4-yl)-6- (cyclobutylmeth...)
Affinity DataIC50:  0.844nMpH: 7.0Assay Description:The Class B enzyme activities were measured in the presence of the test inhibitor in a fluorescence assay against a commercially available substrate ...
Ligand InfoPC cidPC sid
In DepthDetails US Patent