BDBM26273 N-(2-fluorophenyl)-2-{3-[(7-{3-[4-(hydroxymethyl)piperidin-1-yl]propoxy}-6-methoxyquinazolin-4-yl)amino]-1H-pyrazol-5-yl}acetamide::pyrazoloquinazoline deriv., 7
SMILES COc1cc2c(Nc3cc(CC(=O)Nc4ccccc4F)n[nH]3)ncnc2cc1OCCCN1CCC(CO)CC1
InChI Key InChIKey=ADTSCWGDALDZSK-UHFFFAOYSA-N
Data  2 KI
  Tab Delimited (TSV)   2D SDfile   Computed 3D by Vconf -m prep SDfile
Find this compound or compounds like it in BindingDB:
Activity Spreadsheet -- Enzyme Inhibition Constant Data from BindingDB
Found 2 hits for monomerid = 26273
TargetAurora kinase B(Homo sapiens (Human))
Astrazeneca
LigandPNGBDBM26273(N-(2-fluorophenyl)-2-{3-[(7-{3-[4-(hydroxymethyl)p...)
Affinity DataKi:  14nM ΔG°:  -10.6kcal/molepH: 7.5 T: 2°C. Assay description: In vitro kinase assay using recombinant Aurora B bound to INCENP was incubated at room temperature with substrate, and test compounds in the presence...
In DepthDetails ArticlePubMed
TargetAurora kinase A(Homo sapiens (Human))
Astrazeneca
LigandPNGBDBM26273(N-(2-fluorophenyl)-2-{3-[(7-{3-[4-(hydroxymethyl)p...)
Affinity DataKi:  1.40E+3nM ΔG°:  -7.98kcal/moleT: 2°C. Assay description: In vitro kinase assay using recombinant Aurora A purified from Sf9 cells was incubated at room temperature with substrate, and test compounds in the ...
In DepthDetails ArticlePubMed