BDBM262772 3-[6-[3-(dimethylamino)-3- methyl-azetidin-1-yl]-3- pyridyl]-2-(1H-tetrazol-5- yl)benzenesulfonamide::US9708336, 625
SMILES CN(C)C1(C)CN(C1)c1ccc(cn1)-c1cccc(c1-c1nnn[nH]1)S(N)(=O)=O
InChI Key InChIKey=WHVTVBJOYOWPEK-UHFFFAOYSA-N
Data  3 IC50
  Tab Delimited (TSV)   2D SDfile   Computed 3D by Vconf -m prep SDfile
Find this compound or compounds like it in BindingDB:
Activity Spreadsheet -- Enzyme Inhibition Constant Data from BindingDB
Found 3 hits for monomerid = 262772
TargetMetallo-beta-lactamase type 2(Serratia marcescens)
Merck Sharp & Dohme
US Patent
LigandPNGBDBM262772(3-[6-[3-(dimethylamino)-3- methyl-azetidin-1-yl]-3...)
Affinity DataIC50:  203nMpH: 7.0Assay Description:The Class B enzyme activities were measured in the presence of the test inhibitor in a fluorescence assay against a commercially available substrate ...
Ligand InfoPC cidPC sid
In DepthDetails US Patent
TargetVIM-1 metallo-beta-lactamase(Klebsiella pneumoniae)
Merck Sharp & Dohme
US Patent
LigandPNGBDBM262772(3-[6-[3-(dimethylamino)-3- methyl-azetidin-1-yl]-3...)
Affinity DataIC50:  1.35E+3nMpH: 7.0Assay Description:The Class B enzyme activities were measured in the presence of the test inhibitor in a fluorescence assay against a commercially available substrate ...
Ligand InfoPC cidPC sid
In DepthDetails US Patent
TargetMetallo-beta-lactamase type 2(Klebsiella pneumoniae)
Merck Sharp & Dohme
US Patent
LigandPNGBDBM262772(3-[6-[3-(dimethylamino)-3- methyl-azetidin-1-yl]-3...)
Affinity DataIC50:  37nMpH: 7.0Assay Description:The Class B enzyme activities were measured in the presence of the test inhibitor in a fluorescence assay against a commercially available substrate ...
Ligand InfoPC cidPC sid
In DepthDetails US Patent