BDBM263058 US9708340, 39
SMILES OC(=O)[C@H]1CCN1C(=O)Nc1cc(Cl)ccc1-c1cc(F)cc(F)c1
InChI Key InChIKey=PELJMTVWQYSILO-OAHLLOKOSA-N
Data  2 IC50
  Tab Delimited (TSV)   2D SDfile   Computed 3D by Vconf -m prep SDfile
Find this compound or compounds like it in BindingDB:
Activity Spreadsheet -- Enzyme Inhibition Constant Data from BindingDB
Found 2 hits for monomerid = 263058
TargetFatty acid-binding protein 5(Homo sapiens (Human))
Hoffmann-La Roche
US Patent
LigandPNGBDBM263058(US9708340, 39)
Affinity DataIC50: >5.00E+4nM
Ligand InfoPC cidPC sid
In DepthDetails US Patent
TargetFatty acid-binding protein, adipocyte(Homo sapiens (Human))
Hoffmann-La Roche
US Patent
LigandPNGBDBM263058(US9708340, 39)
Affinity DataIC50:  60nMpH: 7.5 T: 2°C. Assay description: Compounds were profiled for activity against human FABP4 (huFABP4) and/or human FABP5 (huFABP5) in Terbium (Tb) time resolved-fluorescence energy tra...
Ligand InfoPC cidPC sid
In DepthDetails US Patent