BDBM263353 US9546162, 11
SMILES COc1cccc(CN2Cc3cccc(CCc4ccc(cc4)C(O)=O)c3C2)c1
InChI Key InChIKey=IBKKPBBTQLRVMW-UHFFFAOYSA-N
Data  4 KI  3 EC50
  Tab Delimited (TSV)   2D SDfile   Computed 3D by Vconf -m prep SDfile
Find this compound or compounds like it in BindingDB:
Activity Spreadsheet -- Enzyme Inhibition Constant Data from BindingDB
Found 4 hits for monomerid = 263353
TargetProstaglandin E2 receptor EP2 subtype(Homo sapiens (Human))
Allergan
US Patent
LigandPNGBDBM263353(US9546162, 11)
Affinity DataKi:  6nM EC50:  13nMpH: 7.4Assay Description:HEK-293 cells stably expressing the human or feline FP receptor, or EP1, EP2, or EP4 receptors were washed with TME buffer, scraped from the bottom o...
Ligand InfoPC cidPC sid
In DepthDetails US Patent
TargetProstaglandin E2 receptor EP2 subtype(Homo sapiens (Human))
Allergan
US Patent
LigandPNGBDBM263353(US9546162, 11)
Affinity DataKi:  240nM EC50:  220nMpH: 7.4Assay Description:HEK-293 cells stably expressing the human or feline FP receptor, or EP1, EP2, or EP4 receptors were washed with TME buffer, scraped from the bottom o...
Ligand InfoPC cidPC sid
In DepthDetails US Patent
TargetProstaglandin E2 receptor EP2 subtype(Homo sapiens (Human))
Allergan
US Patent
LigandPNGBDBM263353(US9546162, 11)
Affinity DataKi:  6.88E+3nMpH: 7.4Assay Description:Cells were seeded at a density of 5×104 cells per well in Biocoat® Poly-D-lysine-coated black-wall, clear-bottom 96-well plates (Becton-Dickinson) an...
Ligand InfoPC cidPC sid
In DepthDetails US Patent
TargetProstaglandin E2 receptor EP4 subtype(Homo sapiens (Human))
Allergan
US Patent
LigandPNGBDBM263353(US9546162, 11)
Affinity DataKi:  9.56E+3nM EC50: >1.00E+4nMpH: 7.4Assay Description:Cells were seeded at a density of 5×104 cells per well in Biocoat® Poly-D-lysine-coated black-wall, clear-bottom 96-well plates (Becton-Dickinson) an...
Ligand InfoPC cidPC sid
In DepthDetails US Patent