BDBM263382 US9550741, I-16
SMILES COc1ccc2oc(cc2c1)C(=O)N[C@H]1CC[C@H](CCN2CCN(CC2)c2nsc3ccccc23)CC1
InChI Key InChIKey=UEUHNMQUIFFWEA-AQYVVDRMSA-N
Data  8 KI
  Tab Delimited (TSV)   2D SDfile   Computed 3D by Vconf -m prep SDfile
Find this compound or compounds like it in BindingDB:
Activity Spreadsheet -- Enzyme Inhibition Constant Data from BindingDB
Found 8 hits for monomerid = 263382
TargetD(2) dopamine receptor(Homo sapiens (Human))
Shanghai Institute Of Pharmaceutical Industry
US Patent
LigandPNGBDBM263382(US9550741, I-16)
Affinity DataKi:  1.05nMpH: 7.5Assay Description:1. Experimental Materials:(1) D2 receptor Cell Transfection:This experiment utilizes the plasmid vector containing the gene of D2 receptor protein fo...
Ligand InfoPC cidPC sid
In DepthDetails US Patent
TargetD(2) dopamine receptor(Homo sapiens (Human))
Shanghai Institute Of Pharmaceutical Industry
US Patent
LigandPNGBDBM263382(US9550741, I-16)
Affinity DataKi:  1.05nMpH: 7.5Assay Description:1. Experimental Materials:(1) D2 receptor Cell Transfection:This experiment utilizes the plasmid vector containing the gene of D2 receptor protein fo...
Ligand InfoPC cidPC sid
In DepthDetails US Patent
Target5-hydroxytryptamine receptor 2A(Homo sapiens (Human))
Shanghai Institute Of Pharmaceutical Industry
US Patent
LigandPNGBDBM263382(US9550741, I-16)
Affinity DataKi:  1.12nMpH: 7.7Assay Description:1. Experimental Materials(1) 5-HT2A Cell Transfection:This experiment utilizes the plasmid vector containing the gene of the 5-HT2A receptor protein ...
Ligand InfoPC cidPC sid
In DepthDetails US Patent
Target5-hydroxytryptamine receptor 2A(Homo sapiens (Human))
Shanghai Institute Of Pharmaceutical Industry
US Patent
LigandPNGBDBM263382(US9550741, I-16)
Affinity DataKi:  1.12nMpH: 7.7Assay Description:1. Experimental Materials(1) 5-HT2A Cell Transfection:This experiment utilizes the plasmid vector containing the gene of the 5-HT2A receptor protein ...
Ligand InfoPC cidPC sid
In DepthDetails US Patent
TargetVitamin D3 receptor(Homo sapiens (Human))
Shanghai Institute Of Pharmaceutical Industry
US Patent
LigandPNGBDBM263382(US9550741, I-16)
Affinity DataKi:  1.87nM. Assay description: The experiment is carried out by the method according to Journal of Pharmacology and Experimental Therapeutics 2010, 333(1): 328. With [3H]methyl-spi...
Ligand InfoPC cidPC sid
In DepthDetails US Patent
TargetVitamin D3 receptor(Homo sapiens (Human))
Shanghai Institute Of Pharmaceutical Industry
US Patent
LigandPNGBDBM263382(US9550741, I-16)
Affinity DataKi:  1.87nM. Assay description: The experiment is carried out by the method according to Journal of Pharmacology and Experimental Therapeutics 2010, 333(1): 328. With [3H]methyl-spi...
Ligand InfoPC cidPC sid
In DepthDetails US Patent
Target5-hydroxytryptamine receptor 1A(Homo sapiens (Human))
Shanghai Institute Of Pharmaceutical Industry
US Patent
LigandPNGBDBM263382(US9550741, I-16)
Affinity DataKi:  6.20nMpH: 7.4Assay Description:1. Experimental Materials:The isotopic ligand of 5-H1A receptor [3H]0.8-OH-DPAT (purchased from PE Corporation), (+)5-hydroxytryptamine (purchased fr...
Ligand InfoPC cidPC sid
In DepthDetails US Patent
Target5-hydroxytryptamine receptor 1A(Homo sapiens (Human))
Shanghai Institute Of Pharmaceutical Industry
US Patent
LigandPNGBDBM263382(US9550741, I-16)
Affinity DataKi:  6.20nMpH: 7.4Assay Description:1. Experimental Materials:The isotopic ligand of 5-H1A receptor [3H]0.8-OH-DPAT (purchased from PE Corporation), (+)5-hydroxytryptamine (purchased fr...
Ligand InfoPC cidPC sid
In DepthDetails US Patent