BDBM263394 US9550741, II-4
SMILES O=S(=O)(N[C@H]1CC[C@H](CCN2CCN(CC2)c2nsc3ccccc23)CC1)c1cc2ccccc2s1
InChI Key InChIKey=BAWYBBXTSLJQTI-AQYVVDRMSA-N
Data  11 KI
  Tab Delimited (TSV)   2D SDfile   Computed 3D by Vconf -m prep SDfile
Find this compound or compounds like it in BindingDB:
Activity Spreadsheet -- Enzyme Inhibition Constant Data from BindingDB
Found 11 hits for monomerid = 263394
Target5-hydroxytryptamine receptor 2A(Homo sapiens (Human))
Shanghai Institute Of Pharmaceutical Industry
US Patent
LigandPNGBDBM263394(US9550741, II-4)
Affinity DataKi:  0.880nMpH: 7.7Assay Description:1. Experimental Materials(1) 5-HT2A Cell Transfection:This experiment utilizes the plasmid vector containing the gene of the 5-HT2A receptor protein ...
Ligand InfoPC cidPC sid
In DepthDetails US Patent
Target5-hydroxytryptamine receptor 2A(Homo sapiens (Human))
Shanghai Institute Of Pharmaceutical Industry
US Patent
LigandPNGBDBM263394(US9550741, II-4)
Affinity DataKi:  0.880nMpH: 7.7Assay Description:1. Experimental Materials(1) 5-HT2A Cell Transfection:This experiment utilizes the plasmid vector containing the gene of the 5-HT2A receptor protein ...
Ligand InfoPC cidPC sid
In DepthDetails US Patent
TargetVitamin D3 receptor(Homo sapiens (Human))
Shanghai Institute Of Pharmaceutical Industry
US Patent
LigandPNGBDBM263394(US9550741, II-4)
Affinity DataKi:  1.03nM. Assay description: The experiment is carried out by the method according to Journal of Pharmacology and Experimental Therapeutics 2010, 333(1): 328. With [3H]methyl-spi...
Ligand InfoPC cidPC sid
In DepthDetails US Patent
TargetVitamin D3 receptor(Homo sapiens (Human))
Shanghai Institute Of Pharmaceutical Industry
US Patent
LigandPNGBDBM263394(US9550741, II-4)
Affinity DataKi:  1.03nM. Assay description: The experiment is carried out by the method according to Journal of Pharmacology and Experimental Therapeutics 2010, 333(1): 328. With [3H]methyl-spi...
Ligand InfoPC cidPC sid
In DepthDetails US Patent
Target5-hydroxytryptamine receptor 2A(Homo sapiens (Human))
Shanghai Institute Of Pharmaceutical Industry
US Patent
LigandPNGBDBM263394(US9550741, II-4)
Affinity DataKi:  1.04nMpH: 7.7Assay Description:1. Experimental Materials(1) 5-HT2A Cell Transfection:This experiment utilizes the plasmid vector containing the gene of the 5-HT2A receptor protein ...
Ligand InfoPC cidPC sid
In DepthDetails US Patent
Target5-hydroxytryptamine receptor 2A(Homo sapiens (Human))
Shanghai Institute Of Pharmaceutical Industry
US Patent
LigandPNGBDBM263394(US9550741, II-4)
Affinity DataKi:  1.04nMpH: 7.7Assay Description:1. Experimental Materials(1) 5-HT2A Cell Transfection:This experiment utilizes the plasmid vector containing the gene of the 5-HT2A receptor protein ...
Ligand InfoPC cidPC sid
In DepthDetails US Patent
TargetD(2) dopamine receptor(Homo sapiens (Human))
Shanghai Institute Of Pharmaceutical Industry
US Patent
LigandPNGBDBM263394(US9550741, II-4)
Affinity DataKi:  1.69nMpH: 7.5Assay Description:1. Experimental Materials:(1) D2 receptor Cell Transfection:This experiment utilizes the plasmid vector containing the gene of D2 receptor protein fo...
Ligand InfoPC cidPC sid
In DepthDetails US Patent
TargetD(2) dopamine receptor(Homo sapiens (Human))
Shanghai Institute Of Pharmaceutical Industry
US Patent
LigandPNGBDBM263394(US9550741, II-4)
Affinity DataKi:  1.69nMpH: 7.5Assay Description:1. Experimental Materials:(1) D2 receptor Cell Transfection:This experiment utilizes the plasmid vector containing the gene of D2 receptor protein fo...
Ligand InfoPC cidPC sid
In DepthDetails US Patent
Target5-hydroxytryptamine receptor 1A(Homo sapiens (Human))
Shanghai Institute Of Pharmaceutical Industry
US Patent
LigandPNGBDBM263394(US9550741, II-4)
Affinity DataKi:  3.95nMpH: 7.4Assay Description:1. Experimental Materials:The isotopic ligand of 5-H1A receptor [3H]0.8-OH-DPAT (purchased from PE Corporation), (+)5-hydroxytryptamine (purchased fr...
Ligand InfoPC cidPC sid
In DepthDetails US Patent
Target5-hydroxytryptamine receptor 1A(Homo sapiens (Human))
Shanghai Institute Of Pharmaceutical Industry
US Patent
LigandPNGBDBM263394(US9550741, II-4)
Affinity DataKi:  5.79nMpH: 7.4Assay Description:1. Experimental Materials:The isotopic ligand of 5-H1A receptor [3H]0.8-OH-DPAT (purchased from PE Corporation), (+)5-hydroxytryptamine (purchased fr...
Ligand InfoPC cidPC sid
In DepthDetails US Patent
Target5-hydroxytryptamine receptor 1A(Homo sapiens (Human))
Shanghai Institute Of Pharmaceutical Industry
US Patent
LigandPNGBDBM263394(US9550741, II-4)
Affinity DataKi:  5.79nMpH: 7.4Assay Description:1. Experimental Materials:The isotopic ligand of 5-H1A receptor [3H]0.8-OH-DPAT (purchased from PE Corporation), (+)5-hydroxytryptamine (purchased fr...
Ligand InfoPC cidPC sid
In DepthDetails US Patent