BDBM263473 (s)-2-(5-methoxy-4-oxobenzo[d][1,2,3]triazin-3 (4h)-yl)-n-(1-(4-methoxyphenyl)ethyl)acetamide::US10561662, Example 38::US11173161, EX 38::US9556130, test 38
SMILES COc1ccc(cc1)[C@H](C)NC(=O)Cn1nnc2cccc(OC)c2c1=O
InChI Key InChIKey=KNJBLSXPWYUHOB-LBPRGKRZSA-N
Data  3 KI
  Tab Delimited (TSV)   2D SDfile   Computed 3D by Vconf -m prep SDfile
Find this compound or compounds like it in BindingDB:
Activity Spreadsheet -- Enzyme Inhibition Constant Data from BindingDB
Found 3 hits for monomerid = 263473
TargetProbable G-protein coupled receptor 139(Homo sapiens (Human))
Takeda Pharmaceutical
US Patent
LigandPNGBDBM263473((s)-2-(5-methoxy-4-oxobenzo[d][1,2,3]triazin-3 (4h...)
Affinity DataKi:  619nM ΔG°:  -7.87kcal/molepH: 7.4 T: 2°C. Assay description: This membrane based assay measures the ability of compounds to competitively bind GPR139 in stably transfected CHO-TRex membranes. CHO-TRex (Life Tec...
Ligand InfoPC cidPC sid
In DepthDetails US Patent
TargetProbable G-protein coupled receptor 139(Homo sapiens (Human))
Takeda Pharmaceutical
US Patent
LigandPNGBDBM263473((s)-2-(5-methoxy-4-oxobenzo[d][1,2,3]triazin-3 (4h...)
Affinity DataKi:  619nM. Assay description: Membranes were removed from −80° C., thawed and diluted in cold radioligand assay buffer (20 mM HEPES pH 7.4/5 mM MgCl2/1 mM CaCl2/Roche protea...
Ligand InfoPC cidPC sid
In DepthDetails US Patent
TargetProbable G-protein coupled receptor 139(Homo sapiens (Human))
Takeda Pharmaceutical
US Patent
LigandPNGBDBM263473((s)-2-(5-methoxy-4-oxobenzo[d][1,2,3]triazin-3 (4h...)
Affinity DataKi:  6.19E+5nM. Assay description: This membrane based assay measures the ability of compounds to competitively bind GPR139 in stably transfected CHO-TRex membranes. CHO-TRex (Life Tec...
Ligand InfoPC cidPC sid
In DepthDetails US Patent