BDBM263478 (s)-2-(6,8-dimethyl-4-oxobenzo[d][1,2,3]triazin-3(4h)-yl)-n-(1-p-tolylethyl)acetamide::US10561662, Example 41::US11173161, EX 41::US9556130, test 41
SMILES C[C@H](NC(=O)Cn1nnc2c(C)cc(C)cc2c1=O)c1ccc(C)cc1
InChI Key InChIKey=XXTTXUGTXWCPFU-HNNXBMFYSA-N
Data  3 KI
  Tab Delimited (TSV)   2D SDfile   Computed 3D by Vconf -m prep SDfile
Find this compound or compounds like it in BindingDB:
Activity Spreadsheet -- Enzyme Inhibition Constant Data from BindingDB
Found 3 hits for monomerid = 263478
TargetProbable G-protein coupled receptor 139(Homo sapiens (Human))
Takeda Pharmaceutical
US Patent
LigandPNGBDBM263478((s)-2-(6,8-dimethyl-4-oxobenzo[d][1,2,3]triazin-3(...)
Affinity DataKi:  10nM ΔG°:  -10.1kcal/molepH: 7.4 T: 2°C. Assay description: This membrane based assay measures the ability of compounds to competitively bind GPR139 in stably transfected CHO-TRex membranes. CHO-TRex (Life Tec...
Ligand InfoPC cidPC sid
In DepthDetails US Patent
TargetProbable G-protein coupled receptor 139(Homo sapiens (Human))
Takeda Pharmaceutical
US Patent
LigandPNGBDBM263478((s)-2-(6,8-dimethyl-4-oxobenzo[d][1,2,3]triazin-3(...)
Affinity DataKi:  10nM. Assay description: Membranes were removed from −80° C., thawed and diluted in cold radioligand assay buffer (20 mM HEPES pH 7.4/5 mM MgCl2/1 mM CaCl2/Roche protea...
Ligand InfoPC cidPC sid
In DepthDetails US Patent
TargetProbable G-protein coupled receptor 139(Homo sapiens (Human))
Takeda Pharmaceutical
US Patent
LigandPNGBDBM263478((s)-2-(6,8-dimethyl-4-oxobenzo[d][1,2,3]triazin-3(...)
Affinity DataKi:  1.00E+4nM. Assay description: This membrane based assay measures the ability of compounds to competitively bind GPR139 in stably transfected CHO-TRex membranes. CHO-TRex (Life Tec...
Ligand InfoPC cidPC sid
In DepthDetails US Patent