BDBM263490 (s)-2-(5-methoxy-4-oxobenzo[d][1,2,3]triazin-3(4h)-yl)-n-(1-(4-(trifluoromethoxy)phenyl)ethyl)acetamide::US10561662, Example 58::US11173161, EX 58::US9556130, test 58
SMILES COc1cccc2nnn(CC(=O)N[C@@H](C)c3ccc(OC(F)(F)F)cc3)c(=O)c12
InChI Key InChIKey=LHFAZQQRCGGNJS-NSHDSACASA-N
Data  4 KI  1 EC50
  Tab Delimited (TSV)   2D SDfile   Computed 3D by Vconf -m prep SDfile
Find this compound or compounds like it in BindingDB:
Activity Spreadsheet -- Enzyme Inhibition Constant Data from BindingDB
Found 5 hits for monomerid = 263490
TargetProbable G-protein coupled receptor 139(Homo sapiens (Human))
Takeda Pharmaceutical
US Patent
LigandPNGBDBM263490((s)-2-(5-methoxy-4-oxobenzo[d][1,2,3]triazin-3(4h)...)
Affinity DataKi:  33nM ΔG°:  -9.48kcal/molepH: 7.4 T: 2°C. Assay description: This membrane based assay measures the ability of compounds to competitively bind GPR139 in stably transfected CHO-TRex membranes. CHO-TRex (Life Tec...
Ligand InfoPC cidPC sid
In DepthDetails US Patent
TargetProbable G-protein coupled receptor 139(Homo sapiens (Human))
Takeda Pharmaceutical
US Patent
LigandPNGBDBM263490((s)-2-(5-methoxy-4-oxobenzo[d][1,2,3]triazin-3(4h)...)
Affinity DataKi:  33nM. Assay description: Membranes were removed from −80° C., thawed and diluted in cold radioligand assay buffer (20 mM HEPES pH 7.4/5 mM MgCl2/1 mM CaCl2/Roche protea...
Ligand InfoPC cidPC sid
In DepthDetails US Patent
TargetProbable G-protein coupled receptor 139(Homo sapiens (Human))
Takeda Pharmaceutical
US Patent
LigandPNGBDBM263490((s)-2-(5-methoxy-4-oxobenzo[d][1,2,3]triazin-3(4h)...)
Affinity DataKi:  76nM. Assay description: Displacement of (S)-N-(1-(2-[3H]-4-methoxyphenyl)propan-2-yl)-2-(2,3-dimethyl-7-oxothieno[2,3-d]pyridazin-6(7H)-yl)acetamide from human GPR139 expres...
Ligand InfoPC cidPC sid
In DepthDetails ArticlePubMed
TargetProbable G-protein coupled receptor 139(Homo sapiens (Human))
Takeda Pharmaceutical
US Patent
LigandPNGBDBM263490((s)-2-(5-methoxy-4-oxobenzo[d][1,2,3]triazin-3(4h)...)
Affinity DataKi:  3.30E+4nM. Assay description: This membrane based assay measures the ability of compounds to competitively bind GPR139 in stably transfected CHO-TRex membranes. CHO-TRex (Life Tec...
Ligand InfoPC cidPC sid
In DepthDetails US Patent
TargetProbable G-protein coupled receptor 139(Homo sapiens (Human))
Takeda Pharmaceutical
US Patent
LigandPNGBDBM263490((s)-2-(5-methoxy-4-oxobenzo[d][1,2,3]triazin-3(4h)...)
Affinity DataEC50:  22nM. Assay description: Agonist activity at human GPR139 expressed in CHO-TRex cells assessed as stimulation of calcium signalling incubated for 15 mins by FLIPR assay
Ligand InfoPC cidPC sid
In DepthDetails ArticlePubMed