BDBM263492 (s)-2-(6-methoxy-4-oxobenzo[d][1,2,3]triazin-3(4h)-yl)-n-(1-(4-(trifluoromethyl)phenyl)ethyl)acetamide::US10561662, Example 60::US11173161, EX 60::US9556130, test 60
SMILES COc1ccc2nnn(CC(=O)N[C@@H](C)c3ccc(cc3)C(F)(F)F)c(=O)c2c1
InChI Key InChIKey=ZIDDEVMTDGRYBN-NSHDSACASA-N
Data  3 KI
  Tab Delimited (TSV)   2D SDfile   Computed 3D by Vconf -m prep SDfile
Find this compound or compounds like it in BindingDB:
Activity Spreadsheet -- Enzyme Inhibition Constant Data from BindingDB
Found 3 hits for monomerid = 263492
TargetProbable G-protein coupled receptor 139(Homo sapiens (Human))
Takeda Pharmaceutical
US Patent
LigandPNGBDBM263492((s)-2-(6-methoxy-4-oxobenzo[d][1,2,3]triazin-3(4h)...)
Affinity DataKi:  115nM ΔG°:  -8.79kcal/molepH: 7.4 T: 2°C. Assay description: This membrane based assay measures the ability of compounds to competitively bind GPR139 in stably transfected CHO-TRex membranes. CHO-TRex (Life Tec...
Ligand InfoPC cidPC sid
In DepthDetails US Patent
TargetProbable G-protein coupled receptor 139(Homo sapiens (Human))
Takeda Pharmaceutical
US Patent
LigandPNGBDBM263492((s)-2-(6-methoxy-4-oxobenzo[d][1,2,3]triazin-3(4h)...)
Affinity DataKi:  115nM. Assay description: Membranes were removed from −80° C., thawed and diluted in cold radioligand assay buffer (20 mM HEPES pH 7.4/5 mM MgCl2/1 mM CaCl2/Roche protea...
Ligand InfoPC cidPC sid
In DepthDetails US Patent
TargetProbable G-protein coupled receptor 139(Homo sapiens (Human))
Takeda Pharmaceutical
US Patent
LigandPNGBDBM263492((s)-2-(6-methoxy-4-oxobenzo[d][1,2,3]triazin-3(4h)...)
Affinity DataKi:  1.15E+5nM. Assay description: This membrane based assay measures the ability of compounds to competitively bind GPR139 in stably transfected CHO-TRex membranes. CHO-TRex (Life Tec...
Ligand InfoPC cidPC sid
In DepthDetails US Patent