BDBM263497 (s)?n-(1-(2-fluoro-4-(trifluoromethyl)phenyl)ethyl)-2-(4-oxobenzo[d][1,2,3]triazin-3(4h)-yl)acetamide::US10561662, Example 65::US11173161, EX 65::US9556130, test 65
SMILES C[C@H](NC(=O)Cn1nnc2ccccc2c1=O)c1ccc(cc1F)C(F)(F)F
InChI Key InChIKey=KFLPUQWDEJAHHA-JTQLQIEISA-N
Data  4 KI  1 EC50
  Tab Delimited (TSV)   2D SDfile   Computed 3D by Vconf -m prep SDfile
Find this compound or compounds like it in BindingDB:
Activity Spreadsheet -- Enzyme Inhibition Constant Data from BindingDB
Found 5 hits for monomerid = 263497
TargetProbable G-protein coupled receptor 139(Homo sapiens (Human))
Takeda Pharmaceutical
US Patent
LigandPNGBDBM263497((s)?n-(1-(2-fluoro-4-(trifluoromethyl)phenyl)ethyl...)
Affinity DataKi:  152nM ΔG°:  -8.64kcal/molepH: 7.4 T: 2°C. Assay description: This membrane based assay measures the ability of compounds to competitively bind GPR139 in stably transfected CHO-TRex membranes. CHO-TRex (Life Tec...
Ligand InfoPC cidPC sid
In DepthDetails US Patent
TargetProbable G-protein coupled receptor 139(Homo sapiens (Human))
Takeda Pharmaceutical
US Patent
LigandPNGBDBM263497((s)?n-(1-(2-fluoro-4-(trifluoromethyl)phenyl)ethyl...)
Affinity DataKi:  152nM. Assay description: Membranes were removed from −80° C., thawed and diluted in cold radioligand assay buffer (20 mM HEPES pH 7.4/5 mM MgCl2/1 mM CaCl2/Roche protea...
Ligand InfoPC cidPC sid
In DepthDetails US Patent
TargetProbable G-protein coupled receptor 139(Homo sapiens (Human))
Takeda Pharmaceutical
US Patent
LigandPNGBDBM263497((s)?n-(1-(2-fluoro-4-(trifluoromethyl)phenyl)ethyl...)
Affinity DataKi:  152nM. Assay description: Displacement of (S)-N-(1-(2-[3H]-4-methoxyphenyl)propan-2-yl)-2-(2,3-dimethyl-7-oxothieno[2,3-d]pyridazin-6(7H)-yl)acetamide from human GPR139 expres...
Ligand InfoPC cidPC sid
In DepthDetails ArticlePubMed
TargetProbable G-protein coupled receptor 139(Homo sapiens (Human))
Takeda Pharmaceutical
US Patent
LigandPNGBDBM263497((s)?n-(1-(2-fluoro-4-(trifluoromethyl)phenyl)ethyl...)
Affinity DataKi:  1.52E+5nM. Assay description: This membrane based assay measures the ability of compounds to competitively bind GPR139 in stably transfected CHO-TRex membranes. CHO-TRex (Life Tec...
Ligand InfoPC cidPC sid
In DepthDetails US Patent
TargetProbable G-protein coupled receptor 139(Homo sapiens (Human))
Takeda Pharmaceutical
US Patent
LigandPNGBDBM263497((s)?n-(1-(2-fluoro-4-(trifluoromethyl)phenyl)ethyl...)
Affinity DataEC50:  19nM. Assay description: Agonist activity at human GPR139 expressed in CHO-TRex cells assessed as stimulation of calcium signalling incubated for 15 mins by FLIPR assay
Ligand InfoPC cidPC sid
In DepthDetails ArticlePubMed