BDBM263600 US10087181, Compound 104::US10285988, Compound 104::US9713612, 104
SMILES Cc1cc(ccn1)-c1cc2ccnc(NCc3ccc(cc3)-c3cc[n+]([O-])c(C)c3)c2cn1
InChI Key InChIKey=PDNXAUWZFGJTDW-UHFFFAOYSA-N
Data  3 IC50
  Tab Delimited (TSV)   2D SDfile   Computed 3D by Vconf -m prep SDfile
Find this compound or compounds like it in BindingDB:
Activity Spreadsheet -- Enzyme Inhibition Constant Data from BindingDB
Found 3 hits for monomerid = 263600
TargetProtein Wnt-3a(Homo sapiens (Human))
Curegenix
US Patent
LigandPNGBDBM263600(US10087181, Compound 104 | US10285988, Compound 10...)
Affinity DataIC50:  5nM. Assay description: Materials and Methods: NIH3T3 mouse fibroblast cells (American Type Culture Collection, Manassas, Va.) were transfected with a plasmid containing a l...
Ligand InfoPC cidPC sid
In DepthDetails US Patent
TargetProtein Wnt-3a(Homo sapiens (Human))
Curegenix
US Patent
LigandPNGBDBM263600(US10087181, Compound 104 | US10285988, Compound 10...)
Affinity DataIC50:  5nM. Assay description: Materials and Methods: NIH3T3 mouse fibroblast cells (American Type Culture Collection, Manassas, Va.) were transfected with a plasmid containing a l...
Ligand InfoPC cidPC sid
In DepthDetails US Patent
TargetProtein Wnt-3a(Homo sapiens (Human))
Curegenix
US Patent
LigandPNGBDBM263600(US10087181, Compound 104 | US10285988, Compound 10...)
Affinity DataIC50:  5nM. Assay description: NIH3T3 mouse fibroblast cells (American Type Culture Collection, Manassas, Va.) were transfected with a plasmid containing a luciferase gene driven b...
Ligand InfoPC cidPC sid
In DepthDetails US Patent