BDBM264292 US9714247, 13
SMILES CCn1c2cc(Nc3ccc(C)cn3)ncc2cc(C(C)C)c1=O
InChI Key InChIKey=VFIHDEKGPQWSNT-UHFFFAOYSA-N
Data  3 IC50
  Tab Delimited (TSV)   2D SDfile   Computed 3D by Vconf -m prep SDfile
Find this compound or compounds like it in BindingDB:
Activity Spreadsheet -- Enzyme Inhibition Constant Data from BindingDB
Found 3 hits for monomerid = 264292
TargetTyrosine-protein kinase BTK(Homo sapiens (Human))
Tolero Pharmaceuticals
US Patent
LigandPNGBDBM264292(US9714247, 13)
Affinity DataIC50:  3.00E+3nM. Assay description: A concentration of a drug that reduces the observed activity of an enzyme by 50%. An IC50 is not a true affinity constant and the specific value dete...
Ligand InfoPC cidPC sid
In DepthDetails US Patent
TargetTyrosine-protein kinase Lyn(Homo sapiens (Human))
Tolero Pharmaceuticals
US Patent
LigandPNGBDBM264292(US9714247, 13)
Affinity DataIC50: >5.00E+3nM. Assay description: A concentration of a drug that reduces the observed activity of an enzyme by 50%. An IC50 is not a true affinity constant and the specific value dete...
Ligand InfoPC cidPC sid
In DepthDetails US Patent
TargetProto-oncogene tyrosine-protein kinase Src(Homo sapiens (Human))
Tolero Pharmaceuticals
US Patent
LigandPNGBDBM264292(US9714247, 13)
Affinity DataIC50: >5.00E+3nM. Assay description: A concentration of a drug that reduces the observed activity of an enzyme by 50%. An IC50 is not a true affinity constant and the specific value dete...
Ligand InfoPC cidPC sid
In DepthDetails US Patent