BDBM264388 US9714247, 109
SMILES CCN(CC)CCOc1ccc(Nc2cc3n(CC)c(=O)c(cc3cn2)-c2c(O)cccc2Cl)nc1
InChI Key InChIKey=SOYRXSCZZFMUQH-UHFFFAOYSA-N
Data  3 IC50
  Tab Delimited (TSV)   2D SDfile   Computed 3D by Vconf -m prep SDfile
Find this compound or compounds like it in BindingDB:
Activity Spreadsheet -- Enzyme Inhibition Constant Data from BindingDB
Found 3 hits for monomerid = 264388
TargetTyrosine-protein kinase BTK(Homo sapiens (Human))
Tolero Pharmaceuticals
US Patent
LigandPNGBDBM264388(US9714247, 109)
Affinity DataIC50: <100nM. Assay description: A concentration of a drug that reduces the observed activity of an enzyme by 50%. An IC50 is not a true affinity constant and the specific value dete...
Ligand InfoPC cidPC sid
In DepthDetails US Patent
TargetTyrosine-protein kinase Lyn(Homo sapiens (Human))
Tolero Pharmaceuticals
US Patent
LigandPNGBDBM264388(US9714247, 109)
Affinity DataIC50: <100nM. Assay description: A concentration of a drug that reduces the observed activity of an enzyme by 50%. An IC50 is not a true affinity constant and the specific value dete...
Ligand InfoPC cidPC sid
In DepthDetails US Patent
TargetProto-oncogene tyrosine-protein kinase Src(Homo sapiens (Human))
Tolero Pharmaceuticals
US Patent
LigandPNGBDBM264388(US9714247, 109)
Affinity DataIC50: <100nM. Assay description: A concentration of a drug that reduces the observed activity of an enzyme by 50%. An IC50 is not a true affinity constant and the specific value dete...
Ligand InfoPC cidPC sid
In DepthDetails US Patent