BDBM264595 US9718760, C364
SMILES Oc1ccc(cc1O)C(=O)NCc1cccc(c1)C(F)(F)F
InChI Key InChIKey=BIRGBUIZBSZEOB-UHFFFAOYSA-N
Data  3 IC50
  Tab Delimited (TSV)   2D SDfile   Computed 3D by Vconf -m prep SDfile
Find this compound or compounds like it in BindingDB:
Activity Spreadsheet -- Enzyme Inhibition Constant Data from BindingDB
Found 3 hits for monomerid = 264595
TargetPlasminogen activator inhibitor 1/Urokinase-type plasminogen activator(Homo sapiens (Human))
University Of Michigan
US Patent
LigandPNGBDBM264595(US9718760, C364)
Affinity DataIC50:  4.75E+5nMpH: 7.4 T: 2°C. Assay description: To determine the efficacy of various synthesized compounds as PAI-1 inhibitors, a fluorometric plate assay was carried out to measure the half maxima...
Ligand InfoPC cidPC sid
In DepthDetails US Patent
TargetPlasminogen activator inhibitor 1/Urokinase-type plasminogen activator(Homo sapiens (Human))
University Of Michigan
US Patent
LigandPNGBDBM264595(US9718760, C364)
Affinity DataIC50:  5.33E+5nMpH: 7.4 T: 2°C. Assay description: To determine the efficacy of various synthesized compounds as PAI-1 inhibitors, a fluorometric plate assay was carried out to measure the half maxima...
Ligand InfoPC cidPC sid
In DepthDetails US Patent
TargetPlasminogen activator inhibitor 1/Urokinase-type plasminogen activator(Homo sapiens (Human))
University Of Michigan
US Patent
LigandPNGBDBM264595(US9718760, C364)
Affinity DataIC50:  8.98E+5nMpH: 7.4 T: 2°C. Assay description: To determine the efficacy of various synthesized compounds as PAI-1 inhibitors, a fluorometric plate assay was carried out to measure the half maxima...
Ligand InfoPC cidPC sid
In DepthDetails US Patent