BDBM26467 3-({4-[methyl(3-methyl-1H-indazol-6-yl)amino]pyrimidin-2-yl}amino)benzene-1-sulfonamide::3-aminobenzene sulfonamide, 12a
SMILES CN(c1ccc2c(C)n[nH]c2c1)c1ccnc(Nc2cccc(c2)S(N)(=O)=O)n1
InChI Key InChIKey=HSCPAFQDYZFJML-UHFFFAOYSA-N
Data  5 IC50
  Tab Delimited (TSV)   2D SDfile   Computed 3D by Vconf -m prep SDfile
Find this compound or compounds like it in BindingDB:
Activity Spreadsheet -- Enzyme Inhibition Constant Data from BindingDB
Found 5 hits for monomerid = 26467
TargetVascular endothelial growth factor receptor 2(Homo sapiens (Human))
Gsk
LigandPNGBDBM26467(3-({4-[methyl(3-methyl-1H-indazol-6-yl)amino]pyrim...)
Affinity DataIC50:  0.600nMpH: 7.5 T: 2°C. Assay description: The assay uses purified baculovirus-expressed GST-VEGFR2 interacting with biotinylated peptide substrates. HTRF is based on the proximity of europium...
In DepthDetails ArticlePubMed
TargetCytochrome P450 2C9(Homo sapiens (Human))
Gsk
LigandPNGBDBM26467(3-({4-[methyl(3-methyl-1H-indazol-6-yl)amino]pyrim...)
Affinity DataIC50:  700nMpH: 7.4 T: 2°C. Assay description: A range of concentrations of each compound in a 96-well plate were preincubated in buffer containing recombinant human CYP450 microsomal protein and ...
In DepthDetails ArticlePubMed
TargetCytochrome P450 3A4(Homo sapiens (Human))
Gsk
LigandPNGBDBM26467(3-({4-[methyl(3-methyl-1H-indazol-6-yl)amino]pyrim...)
Affinity DataIC50:  1.60E+4nM. Assay description: A range of concentrations of each compound in a 96-well plate were preincubated in buffer containing recombinant human CYP450 microsomal protein and ...
In DepthDetails ArticlePubMed
TargetCytochrome P450 2D6(Homo sapiens (Human))
Gsk
LigandPNGBDBM26467(3-({4-[methyl(3-methyl-1H-indazol-6-yl)amino]pyrim...)
Affinity DataIC50:  4.80E+3nM. Assay description: A range of concentrations of each compound in a 96-well plate were preincubated in buffer containing recombinant human CYP450 microsomal protein and ...
In DepthDetails ArticlePubMed
TargetCytochrome P450 2C19(Homo sapiens (Human))
Gsk
LigandPNGBDBM26467(3-({4-[methyl(3-methyl-1H-indazol-6-yl)amino]pyrim...)
Affinity DataIC50:  7.20E+3nMpH: 7.4 T: 2°C. Assay description: A range of concentrations of each compound in a 96-well plate were preincubated in buffer containing recombinant human CYP450 microsomal protein and ...
In DepthDetails ArticlePubMed