BDBM265325 US9718790, I-1820
SMILES C[C@H]([C@H](C)n1c(=O)[nH]\c(=N/c2ccc3OCCCc3c2)n(Cc2ccc(Cl)cc2)c1=O)C(O)=O
InChI Key
Data  1 IC50
  Tab Delimited (TSV)   2D SDfile   Computed 3D by Vconf -m prep SDfile
Find this compound or compounds like it in BindingDB:
Activity Spreadsheet -- Enzyme Inhibition Constant Data from BindingDB
Found 1 hit for monomerid = 265325
TargetP2X purinoceptor 3(Homo sapiens (Human))
Shionogi
US Patent
LigandPNGBDBM265325(US9718790, I-1820)
Affinity DataIC50:  204nMpH: 7.5Assay Description:Stably expressing cell line (C6BU-1 transfected with human P2X3 receptor gene (GenBank accession number Y07683) was used. The cells were seeded in a ...
Ligand InfoPC cidPC sid
In DepthDetails US Patent