BDBM265435 US9718790, I-1144
SMILES CCCc1ccc(Cn2\c(=N\c3ccc(OC(C)C)cc3)[nH]c(=O)n(C[C@H](C)C(=O)OC)c2=O)cc1
InChI Key
Data  1 IC50
  Tab Delimited (TSV)   2D SDfile   Computed 3D by Vconf -m prep SDfile
Find this compound or compounds like it in BindingDB:
Activity Spreadsheet -- Enzyme Inhibition Constant Data from BindingDB
Found 1 hit for monomerid = 265435
TargetP2X purinoceptor 3(Homo sapiens (Human))
Shionogi
US Patent
LigandPNGBDBM265435(US9718790, I-1144)
Affinity DataIC50:  764nMpH: 7.5Assay Description:Stably expressing cell line (C6BU-1 transfected with human P2X3 receptor gene (GenBank accession number Y07683) was used. The cells were seeded in a ...
Ligand InfoPC cidPC sid
In DepthDetails US Patent