BDBM26569 (3R,4R)-3-N-hydroxy-4-N-(4-{[2-(propan-2-yl)imidazo[1,2-a]pyridin-3-yl]methyl}benzene)oxane-3,4-dicarboxamide::imidazopyridine, 43
SMILES CC(C)c1nc2ccccn2c1Cc1ccc(cc1)C(=O)N[C@@H]1CCOC[C@@H]1C(=O)NO
InChI Key InChIKey=MMRITKOLOPLQTB-RBUKOAKNSA-N
Data  4 KI  1 IC50
  Tab Delimited (TSV)   2D SDfile   Computed 3D by Vconf -m prep SDfile
Find this compound or compounds like it in BindingDB:
Activity Spreadsheet -- Enzyme Inhibition Constant Data from BindingDB
Found 5 hits for monomerid = 26569
TargetMacrophage metalloelastase(Homo sapiens (Human))
Bristol-Myers Squibb
LigandPNGBDBM26569((3R,4R)-3-N-hydroxy-4-N-(4-{[2-(propan-2-yl)imidaz...)
Affinity DataKi:  580nM. Assay description: The compounds were tested for enzyme inhibition using fluorescence resonance energy transfer (FRET) assay. Fluorescence measurements were performed i...
In DepthDetails ArticlePubMed
Target72 kDa type IV collagenase(Homo sapiens (Human))
Bristol-Myers Squibb
LigandPNGBDBM26569((3R,4R)-3-N-hydroxy-4-N-(4-{[2-(propan-2-yl)imidaz...)
Affinity DataKi: >3.33E+3nM ΔG°: >-7.47kcal/molepH: 7.5 T: 2°C. Assay description: The compounds were tested for enzyme inhibition using fluorescence resonance energy transfer (FRET) assay. Fluorescence measurements were performed i...
In DepthDetails ArticlePubMed
TargetStromelysin-1(Homo sapiens (Human))
Bristol-Myers Squibb
LigandPNGBDBM26569((3R,4R)-3-N-hydroxy-4-N-(4-{[2-(propan-2-yl)imidaz...)
Affinity DataKi: >4.50E+3nM. Assay description: The compounds were tested for enzyme inhibition using fluorescence resonance energy transfer (FRET) assay. Fluorescence measurements were performed i...
In DepthDetails ArticlePubMed
TargetMatrilysin(Homo sapiens (Human))
Bristol-Myers Squibb
LigandPNGBDBM26569((3R,4R)-3-N-hydroxy-4-N-(4-{[2-(propan-2-yl)imidaz...)
Affinity DataKi: >6.37E+3nM. Assay description: The compounds were tested for enzyme inhibition using fluorescence resonance energy transfer (FRET) assay. Fluorescence measurements were performed i...
In DepthDetails ArticlePubMed
TargetDisintegrin and metalloproteinase domain-containing protein 17(Sus scrofa (pig))
Bristol-Myers Squibb
LigandPNGBDBM26569((3R,4R)-3-N-hydroxy-4-N-(4-{[2-(propan-2-yl)imidaz...)
Affinity DataIC50:  3.20nMpH: 7.5 T: 2°C. Assay description: The compounds were tested for enzyme inhibition using fluorescence resonance energy transfer (FRET) assay. Fluorescence measurements were performed i...
In DepthDetails ArticlePubMed