BDBM266471 US9718790, I-2266
SMILES COC(=O)c1cccc(Oc2ccc(cc2)\N=c2/[nH]c(=O)n(C)c(=O)n2Cc2ccc(C)cc2)n1
InChI Key InChIKey=RZJHSOYXIUIKIN-UHFFFAOYSA-N
Data  1 IC50
  Tab Delimited (TSV)   2D SDfile   Computed 3D by Vconf -m prep SDfile
Find this compound or compounds like it in BindingDB:
Activity Spreadsheet -- Enzyme Inhibition Constant Data from BindingDB
Found 1 hit for monomerid = 266471
TargetP2X purinoceptor 3(Homo sapiens (Human))
Shionogi
US Patent
LigandPNGBDBM266471(US9718790, I-2266)
Affinity DataIC50:  44nMpH: 7.5Assay Description:Stably expressing cell line (C6BU-1 transfected with human P2X3 receptor gene (GenBank accession number Y07683) was used. The cells were seeded in a ...
Ligand InfoPC cidPC sid
In DepthDetails US Patent