BDBM26666 (2R)-5,7-dihydroxy-2-phenyl-3,4-dihydro-2H-1-benzopyran-4-one::(R)-5,7-dihydroxyflavanone
SMILES Oc1cc(O)c2C(=O)C[C@@H](Oc2c1)c1ccccc1
InChI Key InChIKey=URFCJEUYXNAHFI-CYBMUJFWSA-N
Data  2 IC50
  Tab Delimited (TSV)   2D SDfile   Computed 3D by Vconf -m prep SDfile
Find this compound or compounds like it in BindingDB:
Activity Spreadsheet -- Enzyme Inhibition Constant Data from BindingDB
Found 2 hits for monomerid = 26666
TargetSerine/threonine-protein kinase pim-1(Homo sapiens (Human))
Loma Linda University School Of Medicine
Curated by ChEMBL
LigandPNGBDBM26666((2R)-5,7-dihydroxy-2-phenyl-3,4-dihydro-2H-1-benzo...)
Affinity DataIC50:  6.03E+4nM. Assay description: Inhibition of PIM1 kinaseChecked by Author
In DepthDetails ArticlePubMed
TargetSerine/threonine-protein kinase pim-1(Homo sapiens (Human))
Loma Linda University School Of Medicine
Curated by ChEMBL
LigandPNGBDBM26666((2R)-5,7-dihydroxy-2-phenyl-3,4-dihydro-2H-1-benzo...)
Affinity DataIC50:  6.02E+4nMpH: 7.0 T: 2°C. Assay description: The 96-well flat-bottomed plates were coated with recombinant GST-BAD. After the plates were blocked, the reaction buffer containing test compound an...
In DepthDetails ArticlePubMed