BDBM266814 US9718790, I-2550
SMILES CCOC(=O)CCn1c(=O)[nH]\c(=N/c2ccc(Oc3ncccn3)cc2)n(Cc2ccc(Cl)cc2)c1=O
InChI Key InChIKey=PVNFXIUWMAKDNO-UHFFFAOYSA-N
Data  1 IC50
  Tab Delimited (TSV)   2D SDfile   Computed 3D by Vconf -m prep SDfile
Find this compound or compounds like it in BindingDB:
Activity Spreadsheet -- Enzyme Inhibition Constant Data from BindingDB
Found 1 hit for monomerid = 266814
TargetP2X purinoceptor 3(Homo sapiens (Human))
Shionogi
US Patent
LigandPNGBDBM266814(US9718790, I-2550)
Affinity DataIC50:  4nMpH: 7.5Assay Description:Stably expressing cell line (C6BU-1 transfected with human P2X3 receptor gene (GenBank accession number Y07683) was used. The cells were seeded in a ...
Ligand InfoPC cidPC sid
In DepthDetails US Patent