BDBM26692 4-oxo-6-(pyridin-3-yl)-9-thia-3-azatricyclo[8.4.0.0^{2,7}]tetradeca-1(10),2(7),5,11,13-pentaene-5-carbonitrile::pyridone-based compound, 20
SMILES O=c1[nH]c-2c(CSc3ccccc-23)c(-c2cccnc2)c1C#N
InChI Key InChIKey=HHSLTISAGULVMZ-UHFFFAOYSA-N
Data  1 IC50
  Tab Delimited (TSV)   2D SDfile   Computed 3D by Vconf -m prep SDfile
Find this compound or compounds like it in BindingDB:
Activity Spreadsheet -- Enzyme Inhibition Constant Data from BindingDB
Found 1 hit for monomerid = 26692
TargetSerine/threonine-protein kinase pim-1(Homo sapiens (Human))
Valeant Pharmaceuticals Research And Development
LigandPNGBDBM26692(4-oxo-6-(pyridin-3-yl)-9-thia-3-azatricyclo[8.4.0....)
Affinity DataIC50:  4.79E+3nMpH: 7.5 T: 2°C. Assay description: PIM-1 kinase activity was evaluated using calf thymus histones as the substrate in a 96-well filter plate format. After incubation, the plate was was...
In DepthDetails ArticlePubMed